bridge
type: Concept
preferred label: Bridge @de
preferred label: ブリッジ @ja-jp
definition: A card game of four players who bet on the hands of each other, developed from Russian whist @en-gb
definition: Jeu de cartes (52) dérivé du whist et qui oppose deux équipes de deux partenaires dont l'une doit réaliser le contrat ou nombre de plis annoncé aux cours d'enchères initiales @fr
definition: Jogo de cartas (52), derivado do whist russo, que opõe 2 equipas de 2 jogadores, em que uma delas deve realizar um contrato ou número de vazas anunciadas no leilão inicial.
definition: お互いのもち札(お金)をかけて、4人のプレーヤーで行うカードゲーム。ロシア式ホイストが発展したもの @ja-jp
definition: Kartenspiel mit vier Spielern, die gegenseitig auf das Blatt des anderen Wetten abschließen, entwickelt aus einem russischen Kartenspiel. @de
definition: Un juego de cartas entre cuatro jugadores quienes apuestas a las manos de cada uno. @es
definition: Jogo de cartas (52), derivado do whist russo, que opõe 2 equipes de 2 jogadores, em que uma delas deve realizar um contrato ou número de vazas anunciadas no leilão inicial.
definition: Gioco di carte in quattro a coppie contrapposte, in cui le carte rappresentano lo strumento necessario per sviluppare le manovre. Trova le sue radici nel whist, praticato in Inghilterra fin dal XVI secolo @it
note: nessuno @it
in scheme: subjectcode
created: 2000-10-30T12:00:00+00:00
modified: 2010-12-15T17:01:09+00:00
broad match: http://cv.iptc.org/newscodes/mediatopic/20000542
broader: http://cv.iptc.org/newscodes/subjectcode/10001000