Bricolage
type: Concept
preferred label: faça você mesmo @pt-br
preferred label: DIY @en-gb
preferred label: Heimwerken @de
preferred label: ＤＩＹ @ja-jp
definition: Do it yourself. Reparatur, Bau oder Instandhaltung im häuslichen Bereich durch einen Nichtfachmann. @de
definition: DIY - do it yourself, faça você mesmo. Construção, reparação ou manutenção de algo feita por um amador, não por um profissional. @pt-br
definition: DIY - do it yourself. Normally the construction, repair or maintenance of residential property by an amateur @en-gb
definition: ドゥ・イット・ユアセルフ。愛好家による住居の建設、修理、維持など。 @ja-jp
definition: Attività manuale e piccoli lavori di costruzione, riparazione o altro eseguiti in casa per passatempo e per proprio diletto; Fai da te
note: nessuno
in scheme: subjectcode
created: 2006-08-21T12:00:00+00:00
modified: 2012-07-10T12:00:00+00:00
broader: http://cv.iptc.org/newscodes/subjectcode/10004000
broad match: http://cv.iptc.org/newscodes/mediatopic/20000570