fazer compras
type: Concept
preferred label: Shopping @de
preferred label: ショッピング @ja-jp
preferred label: shopping @en-gb
definition: Andare in giro per negozi per guardare e fare acquisti, soprattutto di capi di vestiario o accessori personali, ma non l'aspetto strettamente commerciale della vendita @it
definition: Consumer purchasing and related trends, but not the business aspects of retailing @en-gb
definition: Konsumeinkäufe und Entwicklungen in diesem Zusammenhang, nicht den wirtschaftlichen Aspekt des Handels betreffend. @de
definition: Consumo e tendências relacionadas, sem os aspetos relativos ao negócio do retalho.
definition: Consumo e tendências relacionadas, sem os aspectos relativos ao negócio do varejo.
definition: 消費者の購入動向、ただし小売りの事業的側面ではない @ja-jp
note: nessuno @it
in scheme: subjectcode
created: 2006-08-21T12:00:00+00:00
modified: 2012-07-10T12:00:00+00:00
broader: http://cv.iptc.org/newscodes/subjectcode/10004000
broad match: http://cv.iptc.org/newscodes/mediatopic/10000000