jardinagem
type: Concept
preferred label: 園芸 @ja-jp
preferred label: Giardinaggio @it
preferred label: Gärtnern @de
preferred label: gardening @en-gb
definition: 造園、植樹、植栽などの植物に関する非営利的側面であり、本人と他の人々に喜びをもたらす @ja-jp
definition: Aspetos não comerciais do paisagismo, cultivo de plantas, de árvores e de outra vegetação, que dão prazer ao jardineiro e a outros.
definition: Aspectos não comerciais do paisagismo, cultivo de plantas, de árvores e de outra vegetação, que dão prazer ao jardineiro e a outros.
definition: The non-commercial aspects of landscaping, growing plants, trees and other vegetation that gives pleasure to the gardener and others @en-gb
definition: Arte, tecnica ed altri aspetti non commerciali riguardanti la cura delle piante, degli alberi e del verde in generale, intesa come passatempo per chi lo fa @it
definition: nicht-kommerzielle Seite der Gärtnerei, Bepflanzung von Bäumen und anderer Vegetation, die dem Gärtner und anderen Freude machen. @de
note: nessuno @it
in scheme: subjectcode
created: 2006-08-21T12:00:00+00:00
modified: 2012-07-10T12:00:00+00:00
broader: http://cv.iptc.org/newscodes/subjectcode/10004000
broad match: http://cv.iptc.org/newscodes/mediatopic/20000550