Vacanze
type: Concept
preferred label: holiday or vacation @en-gb
preferred label: 休暇 @ja-jp
preferred label: Vacances @fr
preferred label: férias @pt-br
preferred label: vacaciones @es
preferred label: Urlaub @de
definition: Artículos sobre viajes recreativos a un solo lugar y/o país durante un período corto. @es
definition: Histórias sobre viagens de lazer a um só lugar ou país durante um curto período de tempo. @pt-pt
definition: Viaggi o permanenza in determinati luoghi per riposo o per svago; Villeggiature
definition: Courte période de repos pendant laquelle une personne se rend en voyage dans un lieu et/ou un pays @fr
definition: 一つの場所そして/あるいは国をまたぐ短い期間のレジャー旅行 @ja-jp
definition: Leisure travel to a single location and/or country over a short period of time @en-gb
definition: Freizeitreise zu einem bestimmten Ort und/oder Land. @de
note: nessuno
in scheme: subjectcode
created: 2000-10-30T12:00:00+00:00
modified: 2010-12-15T17:01:09+00:00
broader: http://cv.iptc.org/newscodes/subjectcode/10000000