Club, associazioni
type: Concept
preferred label: clubes y asociaciones @es
preferred label: clubes e associações @pt-pt
preferred label: クラブ・協会 @ja-jp
preferred label: Associations et clubs @fr
preferred label: Verein @de
preferred label: club and association @en-gb
definition: Organización integrada por individuos que comparten los mismos intereses. @es
definition: Organizações a que as pessoas aderem por partilharem interesses similares. @pt-pt
definition: Organizations joined by individuals because of similar interests @en-gb
definition: Circoli o organizzazioni cui aderiscono individui con interessi comuni
definition: Cercle de personnes avec un intérêt commun se réunissant régulièrement dans un lieu déterminé @fr
definition: 同じような興味を持った人が参加する団体 @ja-jp
definition: Einrichtungen, die von Einzelnen besucht werden, aufgrund gemeinsamer Interessen. @de
note: nessuno
in scheme: subjectcode
created: 2000-10-30T12:00:00+00:00
modified: 2010-12-15T17:01:09+00:00
broader: http://cv.iptc.org/newscodes/subjectcode/10000000