Festività
type: Concept
preferred label: Jour férié @fr
preferred label: festivos @es
preferred label: Feiertag @de
preferred label: feriados @pt-pt
preferred label: 休日 @ja-jp
preferred label: public holiday @en-gb
definition: A day or days set off for celebration @en-gb
definition: Giorni dedicati a celebrazioni, cerimonie pubbliche
definition: Día o días destinados a celebraciones. @es
definition: Dia ou dias destinados a celebrações. @pt-pt
definition: Jour(s) de congé férié @fr
definition: 祝うための日あるいは日々 @ja-jp
definition: Ein oder mehrere Tage, die für Feierlichkeiten festgesetzt sind. @de
note: nessuno
in scheme: subjectcode
created: 2000-10-30T12:00:00+00:00
modified: 2010-12-15T17:01:09+00:00
broader: http://cv.iptc.org/newscodes/subjectcode/10000000