Caccia
type: Concept
preferred label: caça @pt-br
preferred label: Jagd @de
preferred label: Chasse @fr
preferred label: caza @es
preferred label: 狩猟 @ja-jp
preferred label: hunting @en-gb
definition: Atividade que envolve o uso de armas ou de armadilhas na captura de animais. @pt-br
definition: Eine Aktivität, bei der Waffen oder Fallen benutzt werden, um Tiere zu fangen. @de
definition: Attività che prevede l'uso di armi o trappole per catturare animali
definition: 武器や罠を使って動物を捕まえる活動 @ja-jp
definition: Una actividad que implica el uso de armas de fuego o tgrampas para la captura de animales. @es
definition: Action de poursuivre des animaux dans le but de les tuer ou de les capturer @fr
definition: An activity involving the use of weapons or traps for the capturing of animals @en-gb
note: nessuno
in scheme: subjectcode
created: 2000-10-30T12:00:00+00:00
modified: 2010-12-15T17:01:09+00:00
broader: http://cv.iptc.org/newscodes/subjectcode/10000000