Questioni Spesa
type: Concept
preferred label: 消費者問題 @ja-jp
preferred label: consumer issue @en-gb
preferred label: Konsum @de
preferred label: questão de consumo @pt-pt
definition: Compras, produtos para o lar, pesquisas relevantes, recolha de produtos. @pt-br
definition: 家庭消費のための商品購入、関連する調査、商品のリコール @ja-jp
definition: Acquisti, prodotti per la casa, indagini, richiami di prodotti
definition: Einkaufen, relevante Umfragen, Reklamationen, Produkte in Bezug auf Haushalt und Wohnen. @de
definition: Shopping, products for the home, relevant surveys, product recalls @en-gb
note: nessuno
in scheme: subjectcode
created: 2006-08-21T12:00:00+00:00
modified: 2012-07-10T12:00:00+00:00
broader: http://cv.iptc.org/newscodes/subjectcode/10000000