Politica
type: Concept
preferred label: 政治 @ja-jp
preferred label: política @es
preferred label: Politik @de
preferred label: Politique @fr
preferred label: politics @en-gb
definition: Exercício do poder local, regional, nacional e internacional ou luta pelo poder e relações entre governos e estados. @pt-br
definition: Tout ce qui est relatif à l'exercice du pouvoir local, régional, national et international ainsi que les relations entre gouvernements et états @fr
definition: Local, regional, national and international exercise of power, or struggle for power, and the relationships between governing bodies and states. @en-gb
definition: 地方、地域、国家および国際的な権力の行使、権力のための闘争や、統治する組織や国家の間の関係 @ja-jp
definition: Lokale, regionale, nationale und internationale Übungen der Stärke oder zur Erlangung von Stärke, und die Beziehung zwischen regierenden Einheiten und Staaten. @de
definition: Ejercicio o lucha local, regional, nacional e internacional por el poder, y relaciones entre las entidades rectoras y los estados. @es
definition: Attività di governo e legislativa a livello locale, regionale, nazionale e internazionale, i partiti, le relazioni tra enti governativi e tra gli stati
note: nessuno
in scheme: subjectcode
created: 2000-10-30T12:00:00+00:00
modified: 2010-12-15T17:01:09+00:00
narrower: http://cv.iptc.org/newscodes/subjectcode/11001000
narrower: http://cv.iptc.org/newscodes/subjectcode/11002000
narrower: http://cv.iptc.org/newscodes/subjectcode/11003000
narrower: http://cv.iptc.org/newscodes/subjectcode/11004000
narrower: http://cv.iptc.org/newscodes/subjectcode/11005000
narrower: http://cv.iptc.org/newscodes/subjectcode/11006000
narrower: http://cv.iptc.org/newscodes/subjectcode/11007000
narrower: http://cv.iptc.org/newscodes/subjectcode/11008000
narrower: http://cv.iptc.org/newscodes/subjectcode/11009000
narrower: http://cv.iptc.org/newscodes/subjectcode/11010000
narrower: http://cv.iptc.org/newscodes/subjectcode/11011000
narrower: http://cv.iptc.org/newscodes/subjectcode/11012000
narrower: http://cv.iptc.org/newscodes/subjectcode/11013000
narrower: http://cv.iptc.org/newscodes/subjectcode/11014000
narrower: http://cv.iptc.org/newscodes/subjectcode/11015000
narrower: http://cv.iptc.org/newscodes/subjectcode/11016000
narrower: http://cv.iptc.org/newscodes/subjectcode/11017000
narrower: http://cv.iptc.org/newscodes/subjectcode/11018000
narrower: http://cv.iptc.org/newscodes/subjectcode/11019000
narrower: http://cv.iptc.org/newscodes/subjectcode/11020000
narrower: http://cv.iptc.org/newscodes/subjectcode/11021000
narrower: http://cv.iptc.org/newscodes/subjectcode/11022000
narrower: http://cv.iptc.org/newscodes/subjectcode/11023000
narrower: http://cv.iptc.org/newscodes/subjectcode/11024000
narrower: http://cv.iptc.org/newscodes/subjectcode/11025000
narrower: http://cv.iptc.org/newscodes/subjectcode/11026000
narrower: http://cv.iptc.org/newscodes/subjectcode/11027000
narrower: http://cv.iptc.org/newscodes/subjectcode/11028000