forças armadas
type: Concept
preferred label: Bundeswehr @de
preferred label: Forces armées @fr
preferred label: 軍隊 @ja-jp
preferred label: fuerzas armadas @es
preferred label: Forze Armate @it
preferred label: armed Forces @en-gb
definition: Funcionários de um governo incumbidos de gerir um conflito armado ou de garantir a segurança de uma nação.
definition: Conjunto das organizações e das forças de combate e de defesa de um estado.
definition: Die Angestellten der Regierung, die im Krieg eingesetzt werden oder die Sicherheit einer Nation durchsetzen. @de
definition: 戦争を行う、あるいは国家の安全保障のために政府により雇用された人たち @ja-jp
definition: Aquellos contratados por el gobierno para dirigir un conflicto armado, o para asegurar la seguridad de un país. @es
definition: Those employed by a government to conduct war, or to enforce the security of a nation @en-gb
definition: Fonctionnaires chargés de conduire la guerre et d'assurer la sécurité d'un pays @fr
definition: Insieme di uomini, donne e mezzi destinati alla difesa militare dello Stato @it
note: nessuno @it
in scheme: subjectcode
created: 2003-04-05T12:00:00+00:00
modified: 2012-07-10T12:00:00+00:00
broader: http://cv.iptc.org/newscodes/subjectcode/11001000