Sistemi missilistici
type: Concept
preferred label: sistemas de misiles @es
preferred label: mísseis @pt-br
preferred label: missile systems @en-gb
preferred label: Raketensystem @de
preferred label: ミサイル @ja-jp
preferred label: Systèmes de missiles @fr
definition: Alles, was ein Gas, eine Explosion, biologische oder chemische Objekte durch die Luft befördert in der Absicht einen Gegner kampfunfähig zu machen, zu verletzen oder zu töten. @de
definition: 敵に障害を与える、または殺傷する目的で、不活性物質や爆発物あるいは生物化学物体を空中に推進させるもの @ja-jp
definition: Dispositivi d'arma autoguidati o teleguidati con sistemi di autopropulsione in grado di portare cariche di vario genere
definition: Todo lo que impulse un objeto inerte, explosivo, biológico o químico a través del aire con el objeto de lisiar, mutilar o matar a un enemigo. @es
definition: Anything that propels an inert, explosive, biological or chemical object through the air with the aim of disabling, maiming or killing an opponent. @en-gb
definition: Engins chargés d'explosifs de forte puissance, d'agents biologiques ou chimiques, ayant leur propre système de propulsion et de guidage dans le but de neutraliser, mutiler ou tuer un adversaire @fr
definition: Tudo o que impulsione um objeto inerte, explosivo, biológico ou químico pelo ar com o objetivo de neutralizar, mutilar ou matar o inimigo. @pt-br
note: nessuno
in scheme: subjectcode
created: 2003-04-05T12:00:00+00:00
modified: 2012-07-10T12:00:00+00:00
broader: http://cv.iptc.org/newscodes/subjectcode/11001000
broad match: http://cv.iptc.org/newscodes/mediatopic/20000602