diplomacia
type: Concept
preferred label: 外交 @ja-jp
preferred label: Diplomazia @it
preferred label: Diplomatie @de
preferred label: diplomacy @en-gb
definition: *Emprego das capacidades orais e de escrita para persuadir outros do seu ponto de vista; arte de negociação entre estados, governos.*
definition: Rapporti politici fra gli Stati ed i Governi, l'attività di negoziazione @it
definition: *Emprego das capacidades orais e de escrita para persuadir outros de seu ponto de vista; arte de negociação entre estados, governos.*
definition: Anwendung sprachlicher oder schreibender Fähigkeiten, um andere von den eigenen Standpunkten zu überzeugen. @de
definition: El uso de las habilidades escritas y habladas que permiten disuadir el punto de vista de otros. @es
definition: The use of verbal and written skills for persuading others to your point of view @en-gb
definition: 言葉や書面であなたの見解を他人に説得する技術 @ja-jp
definition: L'art de la négociation entre états, gouvernements @fr
note: nessuno @it
in scheme: subjectcode
created: 2000-10-30T12:00:00+00:00
modified: 2010-12-15T17:01:09+00:00
broader: http://cv.iptc.org/newscodes/subjectcode/11000000
narrower: http://cv.iptc.org/newscodes/subjectcode/11002001
narrower: http://cv.iptc.org/newscodes/subjectcode/11002002
narrower: http://cv.iptc.org/newscodes/subjectcode/11002003
narrower: http://cv.iptc.org/newscodes/subjectcode/11002004