cimeiras
type: Concept
preferred label: Sommet @fr
preferred label: summit @en-gb
preferred label: cumbre @es
preferred label: Gipfel/G-7/ G-8 @de
preferred label: Summit @it
preferred label: サミット @ja-jp
preferred label: cúpulas
definition: Rencontre entre dirigeants d'au moins deux pays au niveau des chefs d'état ou de gouvernement. (Ex: Conseil européen, G7 et G8) y compris au niveau des ministres des affaires étrangères ou des finances @fr
definition: Includes meetings of leaders, foreign and finance ministers from the Group of Eight major nations and Group of Seven industrialized nations. @en-gb
definition: Inclui reuniões de líderes e dirigentes de ao menos 2 nações (ex.: Conselho Europeu, reunião de ministros das finanças e dos negócios estrangeiros do Grupo dos Oito ou do Grupo dos Sete dos países mais industrializados).
definition: Umfasst Treffen von Regierenden, Außen- und Finanzministern der Gruppe der 8 größten Staaten und der Gruppe der 7 Industriestaaten (G7/G8). @de
definition: Vertici di capi di governo e/o ministri, compresi G8 e G7 @it
definition: Reuniões de chefes de Estado e/ou de governo ou entre líderes de organizações.
definition: Incluye reuniones de líderes, ministros de relaciones exteriores y de finanzas del Grupo de los Ocho países principales y Grupo de los Siete países industrializados. @es
definition: 主要8カ国(G8)および先進7カ国(G7)の首脳、外務大臣及び大蔵大臣の会議 @ja-jp
note: nessuno @it
in scheme: subjectcode
created: 2000-10-30T12:00:00+00:00
modified: 2010-12-15T17:01:09+00:00
broader: http://cv.iptc.org/newscodes/subjectcode/11002000