peace negotiations
type: Concept
preferred label: negociações de paz @pt-br
preferred label: Friedensverhandlung @de
preferred label: Negoziati Pace @it
preferred label: 和平交渉 @ja-jp
definition: Negociações para pôr fim a um conflito armado. @pt-br
definition: 対立の終結を意図した交渉 @ja-jp
definition: Negoziati avviati per porre fine ad un conflitto @it
definition: Negotiations intended to bring an end to a conflict
definition: Verhandlung, die das Ende eines Konflikts herbeiführen soll @de
note: Spostato da 11014002 @it
note: FormalName error fixed
in scheme: subjectcode
created: 2005-08-26T12:00:00+00:00
modified: 2012-07-10T12:00:00+00:00
broader: http://cv.iptc.org/newscodes/subjectcode/11002000