Candidats
type: Concept
preferred label: political candidates @en-gb
preferred label: candidatos eleitorais @pt-br
preferred label: Kandidat @de
preferred label: candidatos políticos @es
preferred label: 候補者 @ja-jp
preferred label: Candidato @it
definition: Individuos que se eligen para representar y tener un cargo político. @es
definition: 公職につくために選択される個人 @ja-jp
definition: Individuals who are chosen to stand for office @en-gb
definition: Chi si presenta per essere votato nella competizione elettorale per una determinata carica politica @it
definition: Individuen, die sich zur Wahl stellen. @de
definition: Personnes qui postulent à un mandat électif
definition: Indivíduos escolhidos para se candidatarem a cargo político. @pt-br
note: nessuno @it
note: moved from SubjectMatter 11014 in V 16
in scheme: subjectcode
created: 2003-04-05T12:00:00+00:00
modified: 2012-07-10T12:00:00+00:00
broader: http://cv.iptc.org/newscodes/subjectcode/11003000