Campagna elettorale
type: Concept
preferred label: Wahlkampf @de
preferred label: campañas políticas @es
preferred label: campanhas eleitorais @pt-br
preferred label: political campaigns @en-gb
preferred label: Campagne électorale @fr
preferred label: 政治活動 @ja-jp
definition: Campaigns for public office @en-gb
definition: Campagne pour l'élection à une charge publique @fr
definition: Kampagnen für öffentliche Parteien. @de
definition: Campañas para tener un cargo político. @es
definition: Campagna che si svolge in vista del voto
definition: Campanha para a eleição de um cargo político. @pt-pt
definition: 公職の運動 @ja-jp
note: nessuno
in scheme: subjectcode
created: 2003-04-05T12:00:00+00:00
modified: 2012-07-10T12:00:00+00:00
broader: http://cv.iptc.org/newscodes/subjectcode/11003000