Politiche
type: Concept
preferred label: eleições nacionais @pt-br
preferred label: Bundestagswahl @de
preferred label: 国政選挙 @ja-jp
preferred label: Elections nationales @fr
preferred label: elecciones nacionales @es
preferred label: national elections @en-gb
definition: Eleger pessoas para o governo a nível nacional. @pt-br
definition: Elegir personas para el gobierno a nivel nacional. @es
definition: Wahl einzelner Regierungsvertreter auf nationaler Ebene. @de
definition: 国家レベルの政治のため、個人を選出 @ja-jp
definition: Elezioni per scegliere rappresentanti e governanti a livello nazionale
definition: Le choix des personnes pour gouverner au niveau national @fr
definition: Choosing individuals for government at a national level @en-gb
note: nessuno
in scheme: subjectcode
created: 2003-04-05T12:00:00+00:00
modified: 2012-07-10T12:00:00+00:00
broader: http://cv.iptc.org/newscodes/subjectcode/11003000