Regionali
type: Concept
preferred label: 地域選挙 @ja-jp
preferred label: Landtagswahl/Bürgerschaftswahl @de
preferred label: eleições regionais @pt-pt
preferred label: elecciones regionales @es
preferred label: Elections régionales @fr
preferred label: regional elections @en-gb
definition: Elezioni per scegliere rappresentanti e governanti a livello Regionale
definition: Elegir personas para el gobierno a nivel regional. @es
definition: 地域レベルで政治家を選ぶ @ja-jp
definition: Le choix des personnes pour gouverner au niveau régional @fr
definition: Choosing individuals for government at a regional level @en-gb
definition: Eleger pessoas para o governo a nível regional. @pt-pt
definition: Wahl einzelner Regierungsvertreter auf der regionalen Ebene. @de
note: nessuno
in scheme: subjectcode
created: 2003-04-05T12:00:00+00:00
modified: 2012-07-10T12:00:00+00:00
broader: http://cv.iptc.org/newscodes/subjectcode/11003000