Amministrative
type: Concept
preferred label: local elections @en-gb
preferred label: elecciones locales @es
preferred label: 地方選挙 @ja-jp
preferred label: Kommunalwahl @de
preferred label: eleições locais @pt-br
preferred label: Elections locales @fr
definition: Le choix des personnes pour gouverner au niveau local, généralement municipal @fr
definition: Choosing individuals for government at the basic level, whether city, village or county @en-gb
definition: Wahl einzelner Regierungsvertreter auf der unteren Ebene, wie Stadt, Kreis oder Bezirk. @de
definition: Elezioni per scegliere rappresentanti e governanti a livello locale (provincia, comune, circoscrizione, ecc.)
definition: Elegir personas para el gobierno a nivel básico, ya sea en cuidad, aldea o condado. @es
definition: Eleger pessoas para o governo a nível local. @pt-br
definition: 都市、村、郡の基本レベルで政治家を選ぶ @ja-jp
note: nessuno
in scheme: subjectcode
created: 2003-04-05T12:00:00+00:00
modified: 2012-07-10T12:00:00+00:00
broader: http://cv.iptc.org/newscodes/subjectcode/11003000