Sondaggio elettorale
type: Concept
preferred label: sondagens @pt-br
preferred label: encuesta @es
preferred label: poll @en-gb
preferred label: 世論調査 @ja-jp
preferred label: Sondage @fr
preferred label: Wahlumfrage @de
definition: Periodic measurement of a political candidate's standing with the public @en-gb
definition: Misurazione periodica del favore del pubblico di cui gode un candidato politico
definition: Avaliação periódica da posição de um político para o público. @pt-pt
definition: Monitoreo constante de la posicion de un político ante el público. @es
definition: Mesure périodique de l'état de l'opinion vis-à-vis d'un parti ou d'un candidat @fr
definition: Regelmäßige Erhebung des Meinungsbildes in der Öffentlichkeit zu einem politischen Kandidaten. @de
definition: 選挙立候補者への市民からの支持を定期的に測定すること @ja-jp
note: nessuno
in scheme: subjectcode
created: 2004-04-22T12:00:00+00:00
modified: 2012-07-10T12:00:00+00:00
broader: http://cv.iptc.org/newscodes/subjectcode/11003000
broad match: http://cv.iptc.org/newscodes/mediatopic/20000574