Europee
type: Concept
preferred label: elecciones europeas @es
preferred label: Europawahl @de
preferred label: Elections européennes @fr
preferred label: 欧州選挙 @ja-jp
preferred label: eleições europeias @pt-pt
preferred label: european elections @en-gb
definition: Wahl von Vertretern in ein Gremium auf höherer als nationaler Ebene, z.B Europaparlament. @de
definition: Elezioni che interessano un'istituzione a livello superiore a quello nazionale, per es. per il Parlamento Europeo
definition: Eleger pessoas para um corpo superior ao governo nacional (ex.: Parlamento Europeu). @pt-pt
definition: Elecciones individuales de un individuo para integrar un cuerpo internacional. Ej. Parlamento Europeo. @es
definition: 国の政府より上位にあたる団体(例えば欧州議会)の構成員を選出すること @ja-jp
definition: Choosing individuals for a body which is at a higher level than national government, e.g. European parliament @en-gb
definition: Elire des candidats au Parlement européen @fr
note: nessuno
in scheme: subjectcode
created: 2004-04-22T12:00:00+00:00
modified: 2012-07-10T12:00:00+00:00
broader: http://cv.iptc.org/newscodes/subjectcode/11003000