Servizi Segreti, Intelligence
type: Concept
preferred label: Spionage und Geheimdienst @de
preferred label: espionaje e inteligencia @es
preferred label: 情報機関 @ja-jp
preferred label: espionagem @pt-pt
preferred label: Espionnage @fr
preferred label: espionage and intelligence @en-gb
definition: Colección secreta de información. @es
definition: Recolha secreta de informações. @pt-pt
definition: Versteckte Beschaffung von Informationen. @de
definition: Raccolta segreta di informazioni ed interventi per la sicurezza dello Stato
definition: Collecte clandestine de renseignements @fr
definition: 情報の隠れた収集 @ja-jp
definition: Covert collection of information @en-gb
note: nessuno
in scheme: subjectcode
created: 2000-10-30T12:00:00+00:00
modified: 2010-12-15T17:01:09+00:00
broader: http://cv.iptc.org/newscodes/subjectcode/11000000