governo (sistema)
type: Concept
preferred label: gobierno @es
preferred label: 政府 @ja-jp
preferred label: Governo @it
preferred label: government @en-gb
preferred label: Regierung @de
preferred label: Gouvernement @fr
definition: 国を統治するためのシステム @ja-jp
definition: Sistema que administra um país.
definition: Groupe de personnes désignées ou élues pour administrer un pays @fr
definition: Divisão do poder no estado, sistema que administra um país.
definition: Das regulierende System eines Landes. @de
definition: Sistema di governo che amministra una nazione @it
definition: El sistema que rige a un país. @es
definition: The system for ruling a country @en-gb
note: nessuno @it
in scheme: subjectcode
created: 2000-10-30T12:00:00+00:00
modified: 2010-12-15T17:01:09+00:00
broader: http://cv.iptc.org/newscodes/subjectcode/11000000
narrower: http://cv.iptc.org/newscodes/subjectcode/11006001
narrower: http://cv.iptc.org/newscodes/subjectcode/11006002
narrower: http://cv.iptc.org/newscodes/subjectcode/11006003
narrower: http://cv.iptc.org/newscodes/subjectcode/11006004
narrower: http://cv.iptc.org/newscodes/subjectcode/11006005
narrower: http://cv.iptc.org/newscodes/subjectcode/11006006
narrower: http://cv.iptc.org/newscodes/subjectcode/11006007
narrower: http://cv.iptc.org/newscodes/subjectcode/11006008
narrower: http://cv.iptc.org/newscodes/subjectcode/11006009
narrower: http://cv.iptc.org/newscodes/subjectcode/11006010
narrower: http://cv.iptc.org/newscodes/subjectcode/11006011
narrower: http://cv.iptc.org/newscodes/subjectcode/11006012
narrower: http://cv.iptc.org/newscodes/subjectcode/11006013