serviços públicos
type: Concept
preferred label: servicios civiles y públicos @es
preferred label: 行政 @ja-jp
preferred label: civil and public service @en-gb
preferred label: Öffentlicher Dienst @de
preferred label: Service public @fr
preferred label: Pubblica amministrazione, PA @it
definition: Les services fournis à titre onéreux ou gratuits par les fonctionnaires de l'état au bénéfice des usagers @fr
definition: Notícias referentes a toda a atividade desempenhada direta ou indiretamente pelo estado para responder a necessidades essenciais do cidadão, da coletividade ou do próprio estado.
definition: El servicio pagado de parte de civiles para el gobierno, y el frecuentemente servicio no pagado de individuos para el beneficio de otros (servicios publicos). @es
definition: Bezahlte Dienstleistung von Zivilisten für die Regierung und die oftmals unbezahlte eherenamtliche Dienstleistung für andere. @de
definition: Enti le cui funzioni principali consistono nel produrre beni e servizi per la collettività non destinati alla vendita; Servizi pubblici @it
definition: Serviços pagos pelos civis para o governo e serviços não pagos de indivíduos para benefício de outros (serviço público).
definition: The paid service by civilians for the government, and the often non-paid service of individuals for the benefit of others (public service) @en-gb
definition: 政府が市民に行うサービス、またしばしば他の利益のための特殊な無償のサービス(社会奉仕) @ja-jp
note: nessuno @it
in scheme: subjectcode
created: 2000-10-30T12:00:00+00:00
modified: 2010-12-15T17:01:09+00:00
broader: http://cv.iptc.org/newscodes/subjectcode/11006000