Sicurezza Cittadini
type: Concept
preferred label: 市民の安全 @ja-jp
preferred label: seguridad ciudadana @es
preferred label: segurança dos cidadãos @pt-pt
preferred label: Innere Sicherheit @de
preferred label: Sécurité publique @fr
preferred label: safety of citizens @en-gb
definition: Políticas do governo para proteger o bem-estar dos seus cidadãos. @pt-pt
definition: Políticas do governo para proteger o bem-estar de seus cidadãos. @pt-br
definition: Políticas gubernamnetales para proteguer el bienestar de los ciudadanos. @es
definition: Government policies to protect the well being of its citizens @en-gb
definition: Politiche pubbliche finalizzate alla protezione del benessere dei cittadini
definition: Les politiques gouvernementales pour protéger le bien être des citoyens @fr
definition: Regierungspolitik, die das Wohlergehen der Bürger schützt. @de
definition: 市民の福利を保護する政府の政策 @ja-jp
note: nessuno
in scheme: subjectcode
created: 2000-10-30T12:00:00+00:00
modified: 2010-12-15T17:01:09+00:00
broader: http://cv.iptc.org/newscodes/subjectcode/11006000