Capo di Stato
type: Concept
preferred label: chefes de estado @pt-pt
preferred label: heads of state @en-gb
preferred label: 国家指導者 @ja-jp
preferred label: Bundespräsident @de
preferred label: Chef de l'Etat @fr
preferred label: jefes de estado @es
definition: Symbolic or actual chief representative of a nation, such as royalty, or president or emir, for example @en-gb
definition: Representante simbólico o jefe actual del país, como la realeza, o el presidente por ejemplo. @es
definition: Representante supremo de uma nação, simbólico ou não, como realeza, presidente ou emir, por exemplo. @pt-pt
definition: Chi rappresenta una nazione o ne è il capo effettivo: presidente, re, emiro, principe ecc.
definition: Symbolischer oder aktiver Repräsentant eines Landes, wie z.B. König, Präsident oder Emir. @de
definition: 例えば王族、大統領あるいは首長のような、国の象徴的であるか、あるいは実際の最高の代表者 @ja-jp
definition: Représentant suprême d'une nation : roi, émir, président,… @fr
note: nessuno
in scheme: subjectcode
created: 2003-04-05T12:00:00+00:00
modified: 2012-07-10T12:00:00+00:00
broader: http://cv.iptc.org/newscodes/subjectcode/11006000