detentores de cargos públicos
type: Concept
preferred label: Hauts fonctionnaires @fr
preferred label: Cariche pubbliche @it
preferred label: 議員 @ja-jp
preferred label: public officials @en-gb
preferred label: funcionários públicos
preferred label: Ministerialbeamter @de
preferred label: funcionarios públicos @es
definition: Individuen, meist gewählt, die im öffentlichen Dienst stehen oder öffentliche Interessen vertreten. @de
definition: Individuals, usually elected, who are in public service or commonly in the public eye. @en-gb
definition: Pessoas, geralmente eleitas para cargos políticos, que estão no serviço público ou frequentemente na opinião pública.
definition: Personnes,élues ou nommées, exercant une charge publique @fr
definition: Importanti ed alte cariche pubbliche e nella pubblica amministrazione rette da alti funzionari, generalmente di nomina governativa @it
definition: 公共サービスまたは広く世間の注目を浴びていることに、通常選出された個人 @ja-jp
definition: Qualquer pessoa eleita ou nomeada que ocupa um cargo público e com funções relativas aos poderes soberanos do governo.
definition: Personas generalmente elegidas, quienes están al servicio publico o generalmente en la opinión publica. @es
note: nessuno @it
in scheme: subjectcode
created: 2003-04-05T12:00:00+00:00
modified: 2012-07-10T12:00:00+00:00
broader: http://cv.iptc.org/newscodes/subjectcode/11006000