ministros
type: Concept
preferred label: Ministres @fr
preferred label: Ministri @it
preferred label: ministros (gobierno) @es
preferred label: 閣僚 @ja-jp
preferred label: ministers (government) @en-gb
preferred label: Minister @de
definition: Responsabili di distinti ministeri, ma anche il primo ministro o il premier, che coordina e presiede l'attività del governo @it
definition: Membre d'un gouvernement à la tête d'un ministère. Leur chef est le premier ministre ou le président du conseil @fr
definition: 補佐官等、各種の政府部門のうちのあるレベルの代表。もう1つのレベルでは、立法府を構成する。首席の大臣は、首相あるいは総理大臣 @ja-jp
definition: Heads of various government departments at one level, also known as secretaries. At another level they form a legislative body. The chief minister is either prime minister or premier. @en-gb
definition: Führungsebene verschiedener Regierungsministerien, auch bekannt als Staatssekretäre. Auf anderen Ebenen bilden sie die Legislative. Der oberste Minister ist entweder der Bundeskanzler oder der Vizekanzler. @de
definition: Jefes de distintos ministerios del gobiernos en un nivel, también conocidos como ministros. En otro nivel, ellos componen un cuerpo legislativo. El ministro principal es el primer ministro o el presidente. @es
definition: Chefes de vários departamentos governamentais, também conhecidos como ministros. A outro nível formam o corpo legislativo. O mais importante entre eles é o primeiro-ministro.
definition: Membro de um gabinete ou conselho de ministros (governo), geralmente responsável por um ministério.
note: nessuno @it
in scheme: subjectcode
created: 2003-04-05T12:00:00+00:00
modified: 2012-07-10T12:00:00+00:00
broader: http://cv.iptc.org/newscodes/subjectcode/11006000