privatizações
type: Concept
preferred label: 民営化政策 @ja-jp
preferred label: Privatisierung @de
preferred label: privatización @es
preferred label: Privatizzazioni @it
preferred label: privatisation @en-gb
preferred label: Privatisation @fr
definition: Transfert au domaine privé d'entreprises ou de biens propriétés de l'état @fr
definition: La privatización de compañias o propiedades pertenecientes al estado. @es
definition: Privatização de empresas ou propriedades estatais.
definition: Processo de venda de uma empresa do setor público ao setor privado.
definition: The privatisation of state-owned companies or property @en-gb
definition: La privatizzazione di società, beni o imprese possedute dallo Stato @it
definition: Private Übernahme von staatlichen Unternehmen oder Staatseigentum. @de
definition: 国有会社あるいは資産の民営化 @ja-jp
note: nessuno @it
in scheme: subjectcode
created: 2003-11-26T12:00:00+00:00
modified: 2012-07-10T12:00:00+00:00
broader: http://cv.iptc.org/newscodes/subjectcode/11006000