Nazionalizzazioni
type: Concept
preferred label: 国営化 @ja-jp
preferred label: Nationalisation @fr
preferred label: nationalisation @en-gb
preferred label: Verstaatlichung @de
preferred label: nacionalización @es
preferred label: nacionalizações @pt-br
definition: 民間企業あるいは資産の取得 @ja-jp
definition: Übernahme von privaten Unternehmen oder Eigentum durch den Staat. @de
definition: State takeover of private companies or property @en-gb
definition: Tomada de posse de empresas ou propriedades privadas por parte do estado. @pt-pt
definition: Transfert au domaine public d'entreprises ou de biens ou de moyens de production privés @fr
definition: El estado se hace cargo de compañias o propiedades privadas. @es
definition: La rilevazione da parte dello stato di società, beni o imprese private
note: nessuno
in scheme: subjectcode
created: 2003-11-26T12:00:00+00:00
modified: 2012-07-10T12:00:00+00:00
broader: http://cv.iptc.org/newscodes/subjectcode/11006000