Diritti umani
type: Concept
preferred label: direitos humanos @pt-br
preferred label: derechos humanos @es
preferred label: Droits de l'homme @fr
preferred label: 人権 @ja-jp
preferred label: Menschenrechte @de
preferred label: human rights @en-gb
definition: Direitos comuns a todos os cidadãos do mundo. @pt-pt
definition: Derechos a los cuales tienen derecho todos los ciudadanos del mundo. @es
definition: Rechte, die von allen Bürgern in Anspruch genommen werden können. @de
definition: Les droits universels des citoyens @fr
definition: Diritti universalmente riconosciuti a tutti i cittadini
definition: 全ての市民が享受する普遍的に与えられた権利 @ja-jp
definition: Rights entitled to be enjoyed by all citizens universally @en-gb
note: nessuno
in scheme: subjectcode
created: 2000-10-30T12:00:00+00:00
modified: 2010-12-15T17:01:09+00:00
broader: http://cv.iptc.org/newscodes/subjectcode/11000000