Senato
type: Concept
preferred label: cámara alta @es
preferred label: Chambre haute @fr
preferred label: câmara alta @pt-br
preferred label: Oberhaus @de
preferred label: 上院 @ja-jp
preferred label: upper house @en-gb
definition: Câmara superior de um corpo legislativo. @pt-br
definition: Senior chamber of a legislative body @en-gb
definition: 立法機関の上級議会 @ja-jp
definition: Chambre haute d'un Parlement législatif (Sénat) @fr
definition: Obere Kammer der Legislative. @de
definition: Cuerpo superior del Poder Legislativo. @es
definition: Camera alta di un corpo legislativo
note: nessuno
in scheme: subjectcode
created: 2004-10-13T12:00:00+00:00
modified: 2012-07-10T12:00:00+00:00
broader: http://cv.iptc.org/newscodes/subjectcode/11009000