Camera
type: Concept
preferred label: lower house @en-gb
preferred label: câmara baixa @pt-pt
preferred label: Chambre basse @fr
preferred label: cámara baja @es
preferred label: Unterhaus @de
preferred label: 下院 @ja-jp
definition: 立法機関の下級議会 @ja-jp
definition: Camera bassa di un corpo legislativo
definition: Chambre basse d'un Parlement législatif (Assemblée) @fr
definition: Câmara inferior de um corpo legislativo. @pt-br
definition: Cuerpo Inferior del Poder Legislativo. @es
definition: The lower chamber of a legislative body @en-gb
definition: Untere Kammer der Legislative. @de
note: nessuno
in scheme: subjectcode
created: 2004-10-13T12:00:00+00:00
modified: 2012-07-10T12:00:00+00:00
broader: http://cv.iptc.org/newscodes/subjectcode/11009000