Organizzazioni non governative (ONG)
type: Concept
preferred label: organizaciones no gubernamentales @es
preferred label: ONG @fr
preferred label: ＮＧＯ @ja-jp
preferred label: Regierungsunabhängige Organisation @de
preferred label: non government organizations (NGO) @en-gb
definition: Grupos que generalmente no son del gobierno que presionan, demuestran o hacen campaña acerca de un amplia gama de temas como economía, medioambiente, etc. @es
definition: Gruppi indipendenti dall'autorità di governo che fanno campagne o danno vita ad iniziative autonome o coordinate su una vasta gamma di argomenti come economia, ambiente, assistenza sanitaria, ecc...
definition: 政府外の公式団体。経済、環境、ヘルスケア等の広範囲の問題に関して働きかけ、デモンストレーションを行う @ja-jp
definition: Associations privées agissant comme groupes de pression auprès des gouvernements (ex : les ONG altermondialistes) et/ou menant des campagnes de sensibilisation pour venir notamment en aide aux populations menacées par la famine, la guerre… @fr
definition: Gruppen, offiziell außerhalb der Regierung stehend, die in einem größeren Themenspektrum Einfluss ausüben, demonstrieren, agieren wie Ökonomie, Umwelt, Gesundheit etc. @de
definition: Grupos não pertencentes ao governo que pressionam, protestam ou fazem campanha sobre vários assuntos como economia, meio ambiente, cuidados de saúde, etc. @pt-pt
definition: Groups officially outside of government that lobby, demonstrate or campaign on a wide range of issues such as economics, environment healthcare etc. @en-gb
note: nessuno
in scheme: subjectcode
created: 2003-04-05T12:00:00+00:00
modified: 2012-07-10T12:00:00+00:00
broader: http://cv.iptc.org/newscodes/subjectcode/11010000