Bilancio Statale
type: Concept
preferred label: state budget and tax @en-gb
preferred label: orçamento do estado e impostos @pt-br
preferred label: 予算・税 @ja-jp
preferred label: Staatshaushalt und Steuern @de
preferred label: presupuesto estatal @es
preferred label: Budget de l'Etat et impôts @fr
definition: Instrumento de gestão do governo que discrimina as receitas e despesas anuais do estado. @pt-pt
definition: Le budget national établi par le gouvernement et voté par le parlement @fr
definition: Manovra di bilancio varata dal governo e votata dal Parlamento
definition: 政府によって発布された国家の予算 @ja-jp
definition: Orçamento nacional promulgado pelo governo. @pt-br
definition: The national budget as promulgated by the government @en-gb
definition: Der von der Regierung verkündete nationale Haushalt. @de
definition: El presupuesto nacional tal y como ha sido promulgado por el gobierno. @es
note: nessuno
in scheme: subjectcode
created: 2000-10-30T12:00:00+00:00
modified: 2010-12-15T17:01:09+00:00
broader: http://cv.iptc.org/newscodes/subjectcode/11000000
narrower: http://cv.iptc.org/newscodes/subjectcode/11013001