Finanze, Tasse
type: Concept
preferred label: finanzas públicas @es
preferred label: finanças públicas @pt-pt
preferred label: Finances publiques @fr
preferred label: public finance @en-gb
preferred label: Öffentliche Gelder @de
preferred label: 歳出 @ja-jp
definition: The money of government used for paying for public programs and services and public debt @en-gb
definition: Dinheiro que o governo usa para financiar programas e serviços públicos e pagar a dívida pública. @pt-br
definition: Regierungsgelder, die für öffentliche Programme, Dienstleistungen und öffentliche Schulden ausgegeben werden. @de
definition: L'argent utilisé pour le financement des programmes et services publics et le remboursement de la dette @fr
definition: 公共事業、公的サービスや公債などの支出を目的とした政府のお金 @ja-jp
definition: Dinero que el gobierno usa para financiar [ programas, deudas y servicios públicos) @es
definition: Denaro utilizzato per finanziare programmi e servizi pubblici, ma anche il debito pubblico
note: nessuno
in scheme: subjectcode
created: 2003-04-05T12:00:00+00:00
modified: 2012-07-10T12:00:00+00:00
broader: http://cv.iptc.org/newscodes/subjectcode/11013000