Friedensvertrag-GELÖSCHT
type: Concept
preferred label: Négociations de paix @fr
preferred label: 平和交渉-使用不可 @ja-jp
preferred label: negociaciones de paz @es
preferred label: negociações de paz-INATIVO @pt-pt
preferred label: Negoziati Pace – ANNULLATO @it
preferred label: peace negotiations-DEPRECATED @en-gb
definition: INATIVO-Negociações para pôr fim a um conflito armado. @pt-br
definition: 対立の終結を意図した交渉 @ja-jp
definition: Négociations visant à mettre fin à un conflit @fr
definition: NA @en-gb
definition: ---
definition: Negoziati avviati per porre fine ad un conflitto – ANNULLATO @it
definition: Negociaciones que tienen como objetivo poner fin a un conflicto armado. @es
note: Hier gelöscht, unter 11002000 verschoben
note: ANNULLATO e spostato in SubjectMatter 11002 in V16 @it
note: moved to SubjectMatter 11002 in V16 @en-gb
in scheme: subjectcode
created: 2003-04-05T12:00:00+00:00
retired: 2005-08-26T00:00:00+00:00
modified: 2012-07-10T12:00:00+00:00
broader: http://cv.iptc.org/newscodes/subjectcode/11014000
broad match: http://cv.iptc.org/newscodes/mediatopic/20000639