Bündnisse-GELÖSCHT
type: Concept
preferred label: alianças-INATIVO @pt-pt
preferred label: 同盟-使用不可 @ja-jp
preferred label: Alliances @fr
preferred label: alianzas @es
preferred label: alliances-DEPRECATED @en-gb
preferred label: Alleanze – ANNULLATO @it
definition: Coalizioni di gruppi che la pensano alla stessa maniera per presentare una forza maggiore contro ogni sfida - ANNULLATO @it
definition: NA @en-gb
definition: INATIVO-Coligações entre grupos com ideais semelhantes, formadas para apresentar uma força mais robusta contra qualquer desafio. @pt-br
definition: どんな挑戦に対しても、より強い力を示すための同種の考え方をもつ組織同志の提携 @ja-jp
definition: Coaliciones dispuestas a imponerse en contra cualquier tipo de desafíos. @es
definition: ---
definition: Pacte, entente, entre plusieurs partis ou puissances @fr
note: moved to SubjectMatter 11002 in V16 @en-gb
note: DEPRECATED in V 16, split to SubjectMatters 11027 and 11028 @fr
note: Hier gelöscht, unter 11002000 verschoben
note: ANNULLATO e spostato in SubjectMatter 11002 in V16 @it
in scheme: subjectcode
created: 2003-04-05T12:00:00+00:00
retired: 2005-08-26T00:00:00+00:00
modified: 2012-07-10T12:00:00+00:00
broader: http://cv.iptc.org/newscodes/subjectcode/11014000
broad match: http://cv.iptc.org/newscodes/mediatopic/20000639