Aree Urbane
type: Concept
preferred label: vivienda y planificación urbana @es
preferred label: Wohnungs- und Städtebau @de
preferred label: 住宅・都市計画 @ja-jp
preferred label: housing and urban planning @en-gb
preferred label: habitação e urbanismo @pt-br
preferred label: Urbanisme @fr
definition: 都市、郊外地域、およびそれら地域の住宅の組織的計画 @ja-jp
definition: Progettazione e governo delle aree urbane e sub-urbane in ogni suo aspetto
definition: Planeamento sistemático de áreas urbanas ou suburbanas e de habitação dentro dessas áreas. @pt-pt
definition: Systematisches Planen von städtischen und vorstädtischen Gebieten und deren Bebauung. @de
definition: Planeamientos sistemáticos de área urbanas o suburbanas y de viviendas dentro de esas áreas. @es
definition: Planejamento sistemático de áreas urbanas ou suburbanas e de vivendas dentro dessas áreas. @pt-br
definition: Le plan d'urbanisme et d'occupation des sols en zone urbaine et suburbaine @fr
definition: Systematic planning of urban and suburban areas and the housing within those areas @en-gb
note: nessuno
in scheme: subjectcode
created: 2000-10-30T12:00:00+00:00
modified: 2010-12-15T17:01:09+00:00
broader: http://cv.iptc.org/newscodes/subjectcode/11016000