Referendum
type: Concept
preferred label: Référendum @fr
preferred label: referendo @pt-pt
preferred label: 国民投票 @ja-jp
preferred label: referenda @en-gb
preferred label: referendos @es
preferred label: Volksbegehren/Referendum @de
definition: Politische Vorschläge, Gesetze und Taten, die von Nicht-Regierungsangehörigen vorgebracht werden und zur Abstimmung durch die Abstimmungsberechtigten vorliegen. @de
definition: Iniziative referendarie proposte all'attenzione del corpo elettorale
definition: 民間の権限者が提案する政治的提案、法律、決定を有権者全体で投票にかけること @ja-jp
definition: Vote direct par lequel les citoyens expriment leur avis sur une proposition de mesure législative ou constitutionnelle, voire locale @fr
definition: Propostas políticas, leis e ações sugeridas por membros ou organismos não governamentais para serem votados pela comunidade. @pt-br
definition: Proposiciones políticas, leyes y acciones sugeridas por oficiales no gubernamentales para ser votados por la comunidad. @es
definition: Political proposals, laws and actions suggested by non-government officials to be voted on by the entire voting body @en-gb
note: nessuno
in scheme: subjectcode
created: 2000-10-30T12:00:00+00:00
modified: 2010-12-15T17:01:09+00:00
broader: http://cv.iptc.org/newscodes/subjectcode/11000000