Politica nucleare
type: Concept
preferred label: política nuclear @pt-pt
preferred label: 原子力政策 @ja-jp
preferred label: nuclear policy @en-gb
preferred label: políticas nucleares @es
preferred label: Atompolitik @de
preferred label: Politique Nucléaire @fr
definition: Politiche del governo riguardanti l'uso di combustibili nucleari per la produzione di energia o armi
definition: Políticas governamentais relativas ao uso de energia nuclear para a produção de energia ou de armas. @pt-pt
definition: Políticas gubernamentales concernientes al uso de energía nuclear para la producción energética o militar. @es
definition: エネルギー生産や兵器のために核燃料を使うことに関する政府の政策 @ja-jp
definition: Politik der Regierung in Bezug auf die Nutzung von nuklearer Energie- oder Waffenproduktion. @de
definition: Government policies as regards to use of nuclear fuels for power production or weapons @en-gb
definition: Les politiques gouvernementales en matière d'utilisation du nucléaire aux fins de produire de l'énergie ou de fabriquer des armes @fr
note: nessuno
in scheme: subjectcode
created: 2000-10-30T12:00:00+00:00
modified: 2010-12-15T17:01:09+00:00
broader: http://cv.iptc.org/newscodes/subjectcode/11000000