Lobbying
type: Concept
preferred label: lobbying @en-gb
preferred label: ロビー活動 @ja-jp
preferred label: Lobby @de
preferred label: Groupe de pression @fr
preferred label: cabildeo @es
definition: The attempt by non-government bodies and individual to affect the outcome of legislation through verbal, or other, persuasion @en-gb
definition: Tentativas de persuasão, verbais ou outras, exercidas por grupos não governamentais e indivíduos, para afetar o resultado dos processos de legislação. @pt-br
definition: Der Versuch nichtregierender Einheiten und Einzelner durch Überzeugung oder Fürsprache die Durchsetzung eines Gesetzes zu beeinflussen. @de
definition: Tentatives de persuasion, verbale ou autres, exercées par des groupes ou des individus pour faire évoluer ou changer un projet de loi ou de réglement gouvernemental @fr
definition: 非政府団体や個人が、口頭やその他の手段で説得することを通して、立法の結果に影響を及ぼそうと試みること @ja-jp
definition: Los intentos de persuación verbales u otro tipo, de una entidad no gubernamental e individuos por afectar los procesos de legislatura. @es
definition: Attività svolta da enti privati o gruppi di pressione per influire sui processi legislativi
note: nessuno
in scheme: subjectcode
created: 2000-10-30T12:00:00+00:00
modified: 2010-12-15T17:01:09+00:00
broader: http://cv.iptc.org/newscodes/subjectcode/11000000