censorship
type: Concept
preferred label: Zensur @de
preferred label: 検閲 @ja-jp
preferred label: censura @es
preferred label: Censure @fr
preferred label: Censura @it
definition: Versuch durch Eingriff jede Art von Gemeinschaft, die Redefreiheit, Religion und Ideen, die gedruckt, gezeichnet, im Cyberspace oder auf anderem Wege verbreitet werden, zu kontrollieren. Umfasst nicht offizielle Reglementierungen wie Kino, Werbung oder Fernsehen. @de
definition: Attempts by any group to control freedoms of speech, religion, and ideas distributed in print, graphics, cyberspace and other ways. Does not include official standards such as cinema ratings, advertising and broadcast standards.
definition: Intentos por controlar las libertades de expresión, religiosa, de culto, e ideas difundidas a través de los medios impresos, el ciberespacio y otros, por una organización o grupo, pero sin incluir el control interno de las industrias sobre sus propios órg @es
definition: Tentativas de um grupo controlar as liberdades de expressão ou religiosa e as ideias difundidas por escrito, no ciberespaço ou por outros meios. Não inclui padrões oficiais como classificação de filmes, padrões de publicidade e de radiodifusão, etc. @pt-br
definition: 組織や団体による表現の自由や宗教、崇拝あるいは印刷物やその他メディアにより広められた理念を規制する試み。しかし、映画評価、広告基準、放送基準のような産業自身の媒体による内部制御を含まない @ja-jp
definition: Ogni tentativo messo in atto da parte di qualcuno per controllare le libertà di parola, religione, e idee espresse attraverso stampa, grafici, spazi cibernetici o in altro modo. @it
definition: Toute tentative pour contrôler la liberté de parole, de religion et de conscience. Sont exclus les notations de films ou de livres, la publicité,... @fr
note: nessuno @it
note: replaced by *freedom of press* in V 12, reintroduced in V13
in scheme: subjectcode
created: 2004-04-28T12:00:00+00:00
modified: 2012-07-10T12:00:00+00:00
broader: http://cv.iptc.org/newscodes/subjectcode/11000000