Sistemi politici
type: Concept
preferred label: Systèmes politiques @fr
preferred label: sistemas políticos @pt-br
preferred label: 政治制度 @ja-jp
preferred label: political systems @en-gb
preferred label: Politisches System @de
definition: Système d'organisation politique @fr
definition: Sistemas desenvolvidos para a organização do governo. @pt-pt
definition: 政府に規律を規定するよう計画されたシステム @ja-jp
definition: Sistemi d'organizzazione politica
definition: Sistema diseñado para brindar orden al gobierno. @es
definition: Systeme, die geschaffen sind um der Regierung ein Regelwerk zur Verfügung zu stellen. @de
definition: Systems designed to provide order to government @en-gb
note: nessuno
in scheme: subjectcode
created: 2003-04-05T12:00:00+00:00
modified: 2012-07-10T12:00:00+00:00
broader: http://cv.iptc.org/newscodes/subjectcode/11024000