Democrazia
type: Concept
preferred label: democracia @pt-br
preferred label: democracy @en-gb
preferred label: 民主主義 @ja-jp
preferred label: Démocratie @fr
preferred label: Demokratie @de
definition: Regierung, in der entweder die Menschen die direkte Macht innehaben, oder durch gewählte Vertreter. @de
definition: Governo no qual o povo detém o poder de maneira direta ou por meio de representantes governamentais eleitos. @pt-pt
definition: Forma di governo in cui la sovranità è esercitata direttamente dal popolo o da suoi rappresentanti da esso eletti
definition: 国民が直接か、あるいは選出した公務員を通して力を持つ政権 @ja-jp
definition: Régime politique ou la souveraineté est exercée par le peuple soit directement soit par l'intermédiaire de ses représentants élus @fr
definition: Gobierno en el cual el pueblo tiene el poder de manera directa, o por medio de funcionarios de gobierno elegidos. @es
definition: Government in which the people hold the power either directly, or through elected officials. @en-gb
note: nessuno
in scheme: subjectcode
created: 2003-04-05T12:00:00+00:00
modified: 2012-07-10T12:00:00+00:00
broader: http://cv.iptc.org/newscodes/subjectcode/11024000