liberdade de imprensa
type: Concept
preferred label: Liberté de la presse @fr
preferred label: freedom of the press @en-gb
preferred label: Pressefreiheit @de
preferred label: libertad de prensa @es
preferred label: 報道の自由 @ja-jp
preferred label: Libertà Stampa @it
definition: Informations sur la liberté de la presse et des médias, les pressions dont font l'objet les journalistes @fr
definition: Historias sobre los derechos et la libertad de los medios de prensa, la presión o intimidación hacia periodistas, censura de la prensa, actividades de entidades gubernamentales, asociaciones periodísticas y/o otras ONG en relación a la libertad de prensa. @es
definition: マスメディアの権利と自由、ジャーナリストに対する圧力や脅迫、マスメディアにおける検閲、報道の自由に関係した政府組織やジャーナリストの団体・組織、その他NGOの活動についての記事 @ja-jp
definition: Mass media rights and freedoms, pressure and intimidation of the journalists, censorship in mass media, activities of government bodies, journalistic associations and/or organizations and other NGOs in regards to press freedom @en-gb
definition: Histórias sobre direitos e liberdades dos mass media, pressão e intimidação de jornalistas, censura nos mass media, atividades de entidades governamentais, associações de jornalistas, organizações e outras ONG em relação à liberdade de imprensa.
definition: Rechte und Freiheiten der Massenmedien, Druck und Einschüchterung von Journalisten, Zensur, Aktivitäten der Regierung, Journalistenverbände und/oder Organisationen die für die Pressefreiheit kämpfen. @de
definition: Histórias sobre direitos e liberdades dos mídia, pressão e intimidação de jornalistas, censura nos mídia, atividades de entidades governamentais, associações de jornalistas, organizações e outras ONG em relação à liberdade de imprensa.
definition: Diritti e libertà della stampa, pressione o intimidazioni che subiscono i giornalisti, ecc. @it
note: replaced *censorship* in V12, added as new Topic in V13 @es
note: nessuno @it
in scheme: subjectcode
created: 2004-04-28T12:00:00+00:00
modified: 2012-07-10T12:00:00+00:00
broader: http://cv.iptc.org/newscodes/subjectcode/11000000