Trattati
type: Concept
preferred label: Internationaler Vertrag @de
preferred label: 条約・協定 @ja-jp
preferred label: treaty @en-gb
preferred label: tratado @pt-pt
definition: 条約(条約法のウィーン条約によって定義されたものとして)は、国際法のもとで拘束力のある、国際的な団体の間の書面契約 @ja-jp
definition: A treaty (as defined by the Vienna Convention on the Law of Treaties) is a written agreement between international entities that is binding under international law. @en-gb
definition: Ein Vertrag (wie es durch die Wiener Vertragsrechtskonvention definiert ist) ist eine schriftliche Vereinbarung zwischen internationalen Gremien, die dem internationalen Recht unterliegt. @de
definition: Um tratado (de acordo com a Convenção de Viena sobre o Direito dos Tratados) é um acordo escrito entre entidades internacionais vinculativo à luz do direito internacional. @pt-pt
definition: Intese vincolanti sottoscritte fra paesi o istituzioni
note: ex 11014000
in scheme: subjectcode
created: 2005-08-26T12:00:00+00:00
modified: 2012-07-10T12:00:00+00:00
broader: http://cv.iptc.org/newscodes/subjectcode/11000000