Organizzazioni internazionali
type: Concept
preferred label: Internationale Organisation @de
preferred label: 国際機関 @ja-jp
preferred label: international organisation @en-gb
preferred label: organizações internacionais @pt-br
definition: Beinhaltet Organisationen mit Mitgliedern und Aufgaben, die internationale Grenzen überschreiten; können auch zwischenstaatliche Organisationen und Organisationen von unabhängigen Staaten beinhalten. @de
definition: （国際機関は）各国を横断する構成員と機能を持つ諸機関を含む。また、独立諸国家の政府間組織を含むこともある @ja-jp
definition: Includes organisations with members and functions that cross international borders, and may include intergovernmental organisations of sovereign nations. @en-gb
definition: Inclui organizações com membros e funções que atravessam fronteiras internacionais e pode incluir organizações intergovernamentais de nações soberanas. @pt-pt
definition: Organizzazioni i cui membri e le cui funzioni operino al di là dei confini dei vari paesi, ma anche organizzazioni intergovernative di paesi sovrani
note: ex 11014000
in scheme: subjectcode
created: 2005-08-26T12:00:00+00:00
modified: 2012-07-10T12:00:00+00:00
broader: http://cv.iptc.org/newscodes/subjectcode/11000000