Credo
type: Concept
preferred label: Glaube @de
preferred label: 信仰 @ja-jp
preferred label: crenças e fé @pt-pt
preferred label: credo (fe) @es
preferred label: belief (faith) @en-gb
preferred label: Croyances @fr
definition: Crenças estabelecidas da religião de um indivíduo. @pt-br
definition: Anerkannte Glaubensinhalte der Religion einzelner. @de
definition: それぞれの宗教の確立した信仰 @ja-jp
definition: Adhésion de l'esprit à une vérité révélée @fr
definition: The established beliefs of an individuals religion @en-gb
definition: Verità rivelata da una religione ai suoi fedeli
definition: Las creencias establecidas por las religiones de los individuos. @es
note: replaced *censorship* in V12, added as new Topic in V13 @fr
note: nessuno
in scheme: subjectcode
created: 2000-10-30T12:00:00+00:00
modified: 2010-12-15T17:01:09+00:00
broader: http://cv.iptc.org/newscodes/subjectcode/12000000
narrower: http://cv.iptc.org/newscodes/subjectcode/12002001
narrower: http://cv.iptc.org/newscodes/subjectcode/12002002